fomite-n
type: LexicalEntry
canonical form: fomite
sense: 09306099-n
part of speech: noun

vehicle-n
type: LexicalEntry
canonical form: vehicle
sense: 09306099-n
part of speech: noun

09306099-n
type: LexicalConcept
in scheme: en-word.net
definition: any inanimate object (as a towel or money or clothing or dishes or books or toys etc.) that can transmit infectious agents from one person to another
ili: i85412
lexfile: noun.object
part of speech: noun
hypernym: 00002684-n