Euphrates-n
type: LexicalEntry
canonical form: Euphrates
sense: 09297645-n
part of speech: noun

Euphrates River-n
type: LexicalEntry
canonical form: Euphrates River
sense: 09297645-n
part of speech: noun

09297645-n
type: LexicalConcept
in scheme: en-word.net
definition: a river in southwestern Asia; flows into the Persian Gulf; was important in the development of several great civilizations in ancient Mesopotamia
ili: i85371
lexfile: noun.object
part of speech: noun
instance hypernym: 09434308-n