Canopus-n
type: LexicalEntry
canonical form: Canopus
sense: 09256041-n
part of speech: noun

09256041-n
type: LexicalConcept
in scheme: en-word.net
definition: supergiant star 650 light years from Earth; second brightest star in the sky
ili: i85149
lexfile: noun.object
part of speech: noun
instance hypernym: 09473857-n