barrier-n
type: LexicalEntry
canonical form: barrier
sense: 09237488-n
part of speech: noun

09237488-n
type: LexicalConcept
in scheme: en-word.net
definition: anything serving to maintain separation by obstructing vision or access
ili: i85046
lexfile: noun.object
part of speech: noun
hypernym: 09372694-n