Virginia-n
type: LexicalEntry
canonical form: Virginia
sense: 09172689-n
part of speech: noun

09172689-n
type: LexicalConcept
in scheme: en-word.net
definition: one of the British colonies that formed the United States, with capital Jamestown or Williamsburg
ili: i84719
lexfile: noun.location
part of speech: noun
instance hypernym: 09070916-n