Fifth Avenue-n
type: LexicalEntry
canonical form: Fifth Avenue
sense: 09143606-n
part of speech: noun

09143606-n
type: LexicalConcept
in scheme: en-word.net
definition: an avenue in Manhattan that separates the east side of Manhattan from the west side
ili: i84558
lexfile: noun.location
part of speech: noun
instance hypernym: 02766477-n