Camden-n
type: LexicalEntry
canonical form: Camden
sense: 09135986-n
part of speech: noun

09135986-n
type: LexicalConcept
in scheme: en-word.net
definition: a city in southwestern New Jersey on the Delaware River near Philadelphia
ili: i84522
lexfile: noun.location
part of speech: noun
instance hypernym: 08542298-n