Billings-n
type: LexicalEntry
canonical form: Billings
sense: 09131358-n
part of speech: noun

09131358-n
type: LexicalConcept
in scheme: en-word.net
definition: the largest city in Montana; located in southern Montana on the Yellowstone river
ili: i84498
lexfile: noun.location
part of speech: noun
instance hypernym: 08542298-n