Grand Rapids-n
type: LexicalEntry
canonical form: Grand Rapids
sense: 09123437-n
part of speech: noun

09123437-n
type: LexicalConcept
in scheme: en-word.net
definition: a city in west central Michigan; noted for manufacturing furniture
ili: i84454
lexfile: noun.location
part of speech: noun
instance hypernym: 08542298-n