Rock Island-n
type: LexicalEntry
canonical form: Rock Island
sense: 09106836-n
part of speech: noun

09106836-n
type: LexicalConcept
in scheme: en-word.net
definition: a town in northwest Illinois on the Mississippi River; site of a Union prison during the American Civil War
ili: i84361
lexfile: noun.location
part of speech: noun
instance hypernym: 08683242-n