Atlanta-n
type: LexicalEntry
canonical form: Atlanta
sense: 09099186-n
part of speech: noun

capital of Georgia-n
type: LexicalEntry
canonical form: capital of Georgia
sense: 09099186-n
part of speech: noun

09099186-n
type: LexicalConcept
in scheme: en-word.net
definition: state capital and largest city of Georgia; chief commercial center of the southeastern United States; was plundered and burned by Sherman's army during the American Civil War
ili: i84317
lexfile: noun.location
part of speech: noun
instance hypernym: 08713353-n
mero part: 08141631-n