Connecticut-n
type: LexicalEntry
canonical form: Connecticut
sense: 09091296-n
part of speech: noun

09091296-n
type: LexicalConcept
in scheme: en-word.net
definition: one of the British colonies that formed the United States, with capital Hartford or Hartford and New Haven
ili: i84277
lexfile: noun.location
part of speech: noun
instance hypernym: 09070916-n