Mesa-n
type: LexicalEntry
canonical form: Mesa
sense: 09080534-n
part of speech: noun

09080534-n
type: LexicalConcept
in scheme: en-word.net
definition: a city in Arizona just to the east of Phoenix; originally a suburb of Phoenix
ili: i84224
lexfile: noun.location
part of speech: noun
instance hypernym: 08542298-n