Decatur-n
type: LexicalEntry
canonical form: Decatur
sense: 09076573-n
part of speech: noun

09076573-n
type: LexicalConcept
in scheme: en-word.net
definition: a town in northern Alabama on the Tennessee River
ili: i84205
lexfile: noun.location
part of speech: noun
instance hypernym: 08683242-n