Odessa-n
type: LexicalEntry
canonical form: Odessa
sense: 09039375-n
part of speech: noun

Odesa-n
type: LexicalEntry
canonical form: Odesa
sense: 09039375-n
part of speech: noun

09039375-n
type: LexicalConcept
in scheme: en-word.net
definition: a port city of south central Ukraine on an arm of the Black Sea
ili: i84054
lexfile: noun.location
part of speech: noun
instance hypernym: 08542298-n
instance hypernym: 08651532-n