Riyadh-n
type: LexicalEntry
canonical form: Riyadh
sense: 09016241-n
part of speech: noun

capital of Saudi Arabia-n
type: LexicalEntry
canonical form: capital of Saudi Arabia
sense: 09016241-n
part of speech: noun

09016241-n
type: LexicalConcept
in scheme: en-word.net
definition: joint capital (with Mecca) of Saudi Arabia located in the central oasis; largest city in Saudi Arabia
ili: i83947
lexfile: noun.location
part of speech: noun
instance hypernym: 08709407-n