Niger-n
type: LexicalEntry
canonical form: Niger
sense: 08995681-n
part of speech: noun

Republic of Niger-n
type: LexicalEntry
canonical form: Republic of Niger
sense: 08995681-n
part of speech: noun

08995681-n
type: LexicalConcept
in scheme: en-word.net
definition: a landlocked republic in West Africa; gained independence from France in 1960; most of the country is dominated by the Sahara Desert
ili: i83851
lexfile: noun.location
part of speech: noun
instance hypernym: 08716193-n
mero member: 09744538-n
mero part: 08995998-n
mero part: 09394062-n