Zomba-n
type: LexicalEntry
canonical form: Zomba
sense: 08983017-n
part of speech: noun

08983017-n
type: LexicalConcept
in scheme: en-word.net
definition: a city in southern Malawi; was the capital until 1971
ili: i83801
lexfile: noun.location
part of speech: noun
instance hypernym: 08542298-n