Poitou-Charentes-n
type: LexicalEntry
canonical form: Poitou-Charentes
sense: 08963997-n
part of speech: noun

Poitou-n
type: LexicalEntry
canonical form: Poitou
sense: 08963997-n
part of speech: noun

08963997-n
type: LexicalConcept
in scheme: en-word.net
definition: a low-lying region of west central France on the Bay of Biscay
ili: i83712
lexfile: noun.location
part of speech: noun
instance hypernym: 08959335-n