Le Havre-n
type: LexicalEntry
canonical form: Le Havre
sense: 08956076-n
part of speech: noun

08956076-n
type: LexicalConcept
in scheme: en-word.net
definition: a port city in northern France on the English Channel at the mouth of the Seine
ili: i83665
lexfile: noun.location
part of speech: noun
instance hypernym: 08542298-n
instance hypernym: 08651532-n