Bali-n
type: LexicalEntry
canonical form: Bali
sense: 08928282-n
part of speech: noun

08928282-n
type: LexicalConcept
in scheme: en-word.net
definition: an island in Indonesia to the east of Java; striking volcanic scenery; culture is known for elaborate dances and rituals and for handicrafts
ili: i83554
lexfile: noun.location
part of speech: noun
instance hypernym: 09339360-n