Leicestershire-n
type: LexicalEntry
canonical form: Leicestershire
sense: 08904239-n
part of speech: noun

Leicester-n
type: LexicalEntry
canonical form: Leicester
sense: 08904239-n
part of speech: noun

08904239-n
type: LexicalConcept
in scheme: en-word.net
definition: a largely agricultural county in central England
ili: i83435
lexfile: noun.location
part of speech: noun
instance hypernym: 08563758-n
mero part: 08899424-n