Leicester-n
type: LexicalEntry
canonical form: Leicester
sense: 08899424-n
part of speech: noun

08899424-n
type: LexicalConcept
in scheme: en-word.net
definition: an industrial city in Leicestershire in central England; built on the site of a Roman settlement
ili: i83407
lexfile: noun.location
part of speech: noun
instance hypernym: 08542298-n