Rio de Janeiro-n
type: LexicalEntry
canonical form: Rio de Janeiro
sense: 08875258-n
part of speech: noun

Rio-n
type: LexicalEntry
canonical form: Rio
sense: 08875258-n
part of speech: noun

08875258-n
type: LexicalConcept
in scheme: en-word.net
definition: the former capital and 2nd largest city of Brazil; chief Brazilian port; famous as a tourist attraction
ili: i83357
lexfile: noun.location
part of speech: noun
instance hypernym: 08542298-n
mero member: 09714415-n