Tasmania-n
type: LexicalEntry
canonical form: Tasmania
sense: 08853115-n
part of speech: noun

08853115-n
type: LexicalConcept
in scheme: en-word.net
definition: an Australian state on the island of Tasmania
ili: i83255
lexfile: noun.location
part of speech: noun
instance hypernym: 08851439-n
mero part: 08853272-n