Toronto-n
type: LexicalEntry
canonical form: Toronto
sense: 08847424-n
part of speech: noun

08847424-n
type: LexicalConcept
in scheme: en-word.net
definition: the provincial capital and largest city in Ontario (and the largest city in Canada)
ili: i83230
lexfile: noun.location
part of speech: noun
domain region: 08837973-n
instance hypernym: 08713012-n
mero part: 03059522-n