Hamilton-n
type: LexicalEntry
canonical form: Hamilton
sense: 08846681-n
part of speech: noun

08846681-n
type: LexicalConcept
in scheme: en-word.net
definition: a port city in southeastern Ontario at the western end of Lake Ontario
ili: i83225
lexfile: noun.location
part of speech: noun
instance hypernym: 08542298-n
instance hypernym: 08651532-n