Halifax-n
type: LexicalEntry
canonical form: Halifax
sense: 08845994-n
part of speech: noun

08845994-n
type: LexicalConcept
in scheme: en-word.net
definition: provincial capital and largest city of Nova Scotia
ili: i83222
lexfile: noun.location
part of speech: noun
instance hypernym: 08713012-n