Vancouver-n
type: LexicalEntry
canonical form: Vancouver
sense: 08842472-n
part of speech: noun

08842472-n
type: LexicalConcept
in scheme: en-word.net
definition: a port city in southwestern British Columbia on an arm of the Pacific Ocean opposite Vancouver Island; Canada's chief Pacific port and third largest city
ili: i83204
lexfile: noun.location
part of speech: noun
instance hypernym: 08542298-n
instance hypernym: 08651532-n