Montenegro-n
type: LexicalEntry
canonical form: Montenegro
sense: 08835087-n
part of speech: noun

Crna Gora-n
type: LexicalEntry
canonical form: Crna Gora
sense: 08835087-n
part of speech: noun

08835087-n
type: LexicalConcept
in scheme: en-word.net
definition: a former country bordering on the Adriatic Sea within the Socialist Federal Republic of Yugoslavia (1944-1992)
ili: i83178
lexfile: noun.location
part of speech: noun
instance hypernym: 08591861-n