Nazareth-n
type: LexicalEntry
canonical form: Nazareth
sense: 08812045-n
part of speech: noun

08812045-n
type: LexicalConcept
in scheme: en-word.net
definition: a historic town in northern Israel that is mentioned in the Gospels as the home of Joseph and Mary
ili: i83074
lexfile: noun.location
part of speech: noun
instance hypernym: 08683242-n