Rostock-n
type: LexicalEntry
canonical form: Rostock
sense: 08792537-n
part of speech: noun

08792537-n
type: LexicalConcept
in scheme: en-word.net
definition: a city in northeastern Germany near the Baltic sea; an important member of the Hanseatic League in the 14th century
ili: i82987
lexfile: noun.location
part of speech: noun
instance hypernym: 08542298-n