Dusseldorf-n
type: LexicalEntry
canonical form: Dusseldorf
sense: 08790500-n
part of speech: noun

08790500-n
type: LexicalConcept
in scheme: en-word.net
definition: an industrial city in western Germany on the Rhine
ili: i82976
lexfile: noun.location
part of speech: noun
instance hypernym: 08542298-n