Guadeloupe-n
type: LexicalEntry
canonical form: Guadeloupe
sense: 08768959-n
part of speech: noun

08768959-n
type: LexicalConcept
in scheme: en-word.net
definition: an island territory of France located in the eastern West Indies; tourism is the major industry
ili: i82876
lexfile: noun.location
part of speech: noun
instance hypernym: 09339360-n