Forbidden City-n
type: LexicalEntry
canonical form: Forbidden City
sense: 08742805-n
part of speech: noun

08742805-n
type: LexicalConcept
in scheme: en-word.net
definition: a walled section of Beijing that encloses the palace that was formerly the residence of the emperor of China
ili: i82741
lexfile: noun.location
part of speech: noun
instance hypernym: 08665897-n