outskirt-n
type: LexicalEntry
canonical form: outskirt
sense: 08708530-n
part of speech: noun

fringe-n
type: LexicalEntry
canonical form: fringe
sense: 08708530-n
part of speech: noun

08708530-n
type: LexicalConcept
in scheme: en-word.net
definition: a part of the city far removed from the center
example: they built a factory on the outskirts of the city
ili: i82614
lexfile: noun.location
part of speech: noun
hypernym: 08555400-n
mero part: 08571977-n