workspace-n
type: LexicalEntry
canonical form: workspace
sense: 08701929-n
part of speech: noun

08701929-n
type: LexicalConcept
in scheme: en-word.net
definition: space allocated for your work (as in an office)
ili: i82579
lexfile: noun.location
part of speech: noun
hypernym: 08670545-n