target-n
type: LexicalEntry
canonical form: target
sense: 08678672-n
part of speech: noun

target area-n
type: LexicalEntry
canonical form: target area
sense: 08678672-n
part of speech: noun

08678672-n
type: LexicalConcept
in scheme: en-word.net
definition: the location of the target that is to be hit
ili: i82481
lexfile: noun.location
part of speech: noun
hypernym: 08682181-n