pleasance-n
type: LexicalEntry
canonical form: pleasance
sense: 08661381-n
part of speech: noun

08661381-n
type: LexicalConcept
in scheme: en-word.net
definition: a pleasant and secluded part of a garden; usually attached to a mansion
ili: i82384
lexfile: noun.location
part of speech: noun
hypernym: 08660590-n