presence-n
type: LexicalEntry
canonical form: presence
sense: 08660207-n
part of speech: noun

front-n
type: LexicalEntry
canonical form: front
sense: 08660207-n
part of speech: noun

08660207-n
type: LexicalConcept
in scheme: en-word.net
definition: the immediate proximity of someone or something
example: she blushed in his presence
example: he sensed the presence of danger
example: he was well behaved in front of company
ili: i82376
lexfile: noun.location
part of speech: noun
hypernym: 08660092-n