quarter-n
type: LexicalEntry
canonical form: quarter
sense: 08645494-n
part of speech: noun

08645494-n
type: LexicalConcept
in scheme: en-word.net
definition: a district of a city having some distinguishing character
example: the Latin Quarter
ili: i82327
lexfile: noun.location
part of speech: noun
hypernym: 08555400-n