lie-n
type: LexicalEntry
canonical form: lie
sense: 08641771-n
part of speech: noun

08641771-n
type: LexicalConcept
in scheme: en-word.net
definition: position or manner in which something is situated
ili: i82307
lexfile: noun.location
part of speech: noun
hypernym: 08639173-n