military position-n
type: LexicalEntry
canonical form: military position
sense: 08640161-n
part of speech: noun

position-n
type: LexicalEntry
canonical form: position
sense: 08640161-n
part of speech: noun

08640161-n
type: LexicalConcept
in scheme: en-word.net
definition: a point occupied by troops for tactical reasons
ili: i82297
lexfile: noun.location
part of speech: noun
domain topic: 08215965-n
hypernym: 08637636-n