silhouette-n
type: LexicalEntry
canonical form: silhouette
sense: 08630920-n
part of speech: noun

08630920-n
type: LexicalConcept
in scheme: en-word.net
definition: an outline of a solid object (as cast by its shadow)
ili: i82246
lexfile: noun.location
part of speech: noun
hypernym: 08630343-n