line-n
type: LexicalEntry
canonical form: line
sense: 08610818-n
part of speech: noun

08610818-n
type: LexicalConcept
in scheme: en-word.net
definition: a spatial location defined by a real or imaginary unidimensional extent
ili: i82138
lexfile: noun.location
part of speech: noun
hypernym: 00027365-n