limb-n
type: LexicalEntry
canonical form: limb
sense: 08610050-n
part of speech: noun

08610050-n
type: LexicalConcept
in scheme: en-word.net
definition: (astronomy) the circumferential edge of the apparent disc of the sun or the moon or a planet
ili: i82133
lexfile: noun.location
part of speech: noun
domain topic: 06104629-n
hypernym: 08583230-n