end-n
type: LexicalEntry
canonical form: end
sense: 08584413-n
part of speech: noun

08584413-n
type: LexicalConcept
in scheme: en-word.net
definition: one of two places from which people are communicating to each other
example: the phone rang at the other end
example: both ends wrote at the same time
ili: i82003
lexfile: noun.location
part of speech: noun
hypernym: 08682181-n