earth-n
type: LexicalEntry
canonical form: earth
sense: 08579604-n
part of speech: noun

Earth-n
type: LexicalEntry
canonical form: Earth
sense: 08579604-n
part of speech: noun

08579604-n
type: LexicalConcept
in scheme: en-word.net
definition: the abode of mortals (as contrasted with Heaven or Hell)
example: it was hell on earth
ili: i81981
lexfile: noun.location
part of speech: noun
hypernym: 00027365-n