south-n
type: LexicalEntry
canonical form: south
sense: 08579120-n
part of speech: noun

08579120-n
type: LexicalConcept
in scheme: en-word.net
definition: a location in the southern part of a country, region, or city
ili: i81977
lexfile: noun.location
part of speech: noun
attribute: https://en-word.net/synset/01609663-a
hypernym: 00027365-n