rear-n
type: LexicalEntry
canonical form: rear
sense: 08499711-n
part of speech: noun

08499711-n
type: LexicalConcept
in scheme: en-word.net
definition: the back of a military formation or procession
example: infantrymen were in the rear
ili: i81629
lexfile: noun.group
part of speech: noun
domain topic: 08215965-n
hypernym: 08443418-n